{"text_format":"1","workbook":"xlsx","n_sheets":8,"sheets":["Instructions","1.Challenges & opportunities","2.Select service categories","3.Review PM services","3.Review I4.0 services (option)","3.Executive summary","4.Scope services","5.Action planning"],"not_rendered":{"charts":0,"images":14,"macros":1,"external_links":0,"defined_names":21,"comments":0,"pivot_tables":2},"unopened":[],"bounds":{"document_bytes":16777216,"sheet_cells":100000,"rows_first":2000,"rows_last":500,"rows_between":2000,"halvings":0,"cell_chars":16384,"cell_head_chars":4096},"cells_cut":0,"cells_raw":0,"read":"whole","date_system":"1900"}

{"sheet":"Instructions","index":0,"n_rows":154,"n_cols":72,"rows_kept":154,"cut":false,"hidden":false,"merged":[[35,2,35,13],[35,17,44,50],[58,2,66,13],[36,2,44,13],[35,54,36,63],[35,64,36,70],[35,71,36,79],[37,54,38,63],[37,64,38,70],[37,71,38,79],[39,54,40,63],[39,64,40,70],[39,71,40,79],[41,54,42,63],[41,64,42,70],[41,71,42,79],[43,54,44,63],[43,64,44,70],[43,71,44,79],[47,2,51,13],[52,2,55,13],[57,2,57,13],[57,17,66,50],[61,54,62,63],[147,1,149,80],[87,12,95,42],[87,46,95,80],[85,12,85,46],[85,48,85,79],[143,1,143,14],[113,2,113,21],[114,2,114,21],[115,2,115,21],[113,61,113,79],[114,61,114,79],[97,1,97,80],[99,3,99,13],[108,3,108,13],[99,20,99,34],[108,19,108,33],[108,45,108,55],[99,45,100,55],[107,45,107,55],[108,67,108,77],[99,67,100,77],[140,1,140,80],[126,1,126,80],[111,1,111,80],[115,61,115,79],[113,23,113,40],[114,23,114,40],[115,23,115,40],[113,42,113,59],[115,42,115,59],[77,54,78,63],[77,64,78,70],[77,71,78,79],[83,1,83,80],[69,2,80,13],[71,54,72,63],[75,64,76,70],[75,71,76,79],[69,71,70,79],[46,2,46,13],[46,17,55,50],[46,54,47,63],[46,64,47,70],[46,71,47,79],[48,54,49,63],[48,64,49,70],[48,71,49,79],[50,54,51,63],[50,64,51,70],[50,71,51,79],[54,54,55,63],[54,64,55,70],[54,71,55,79],[52,54,53,63],[52,64,53,70],[52,71,53,79],[24,2,24,13],[24,17,33,50],[24,54,25,63],[24,64,25,70],[24,71,25,79],[25,2,33,13],[32,54,33,63],[32,64,33,70],[32,71,33,79],[26,54,27,63],[26,64,27,70],[26,71,27,79],[28,54,29,63],[28,64,29,70],[28,71,29,79],[30,54,31,63],[30,64,31,70],[30,71,31,79],[3,1,3,80],[5,1,5,80],[7,1,7,80],[10,1,10,80],[13,1,13,80],[15,1,16,80],[22,2,22,13],[22,54,22,79],[17,54,17,79],[18,54,20,79],[22,17,22,50],[9,1,9,80],[11,1,11,80],[57,54,58,63],[57,64,58,70],[57,71,58,79],[59,54,60,63],[59,64,60,70],[59,71,60,79],[68,2,68,13],[68,17,80,50],[69,54,70,63],[69,64,70,70],[73,64,74,70],[73,71,74,79],[75,54,76,63],[71,64,72,70],[71,71,72,79],[73,54,74,63],[61,64,62,70],[61,71,62,79],[63,54,64,63],[63,64,64,70],[63,71,64,79],[65,54,66,63],[65,64,66,70],[65,71,66,79]]}
[null,"UNIDO EIP Management Services Tool (V1)"]
[null,"EIP MANAGEMENT SERVICES TOOL: INSTRUCTIONS"]
[]
[null,"RATIONALE FOR THE TOOL"]
[]
[null,"In many industrial parks, park management provides the “traditional” services to its tenants such as leasing/selling of industrial land to tenant companies; electricity and water supply billing; maintenance of roads, fences, and office buildings inside park; and basic security services. However, there are many added-value services park management could provide in order to: \n• Assist tenant companies to increase their economic , environmental, and social performance;\n• Reduce the risks of park and the companies,  emphasizing that environmental and social risks are business risks;\n• Create a more resource-efficient and cost-effective industrial park which is more competitive, attractive for investment;\n• Enable tenant companies to concentrate on core business, create cost savings from service synergies.\n\nIn addition, Industry 4.0 provides a new production value chain solutions through ICT development (e.g. Internet-of-things) and smart automation solutions which are applicable to industrial park management and tenant companies. Industry 4.0 will have a significantly influence on the design and operation of industrial processes and industrial parks."]
[]
[null,"TOOL OBJECTIVES"]
[]
[null,"The objective of this tool is to strengthen and advance the services provided by park management to tenant companies, and thereby increase \"value for money\" provided by park management to tenant companies and securing / expanding revenues of park management entity. The tool assist industrial park management entities and tenant companies with reviewing, prioritizing, scoping, and action planning of fit-for-purpose and added-value services to their park and tenant companies. "]
{"$rows_left_out":145}
{"sheet":"1.Challenges & opportunities","index":1,"n_rows":25,"n_cols":8,"rows_kept":25,"cut":false,"hidden":false,"merged":[[24,7,24,8],[20,4,20,6],[21,4,21,6],[23,4,23,6],[24,4,24,6],[21,7,21,8],[23,7,23,8],[20,7,20,8],[22,4,22,6],[22,7,22,8],[13,1,16,1],[8,7,8,8],[9,7,9,8],[10,7,10,8],[12,7,12,8],[13,7,13,8],[11,4,11,6],[15,4,15,6],[16,4,16,6],[11,7,11,8],[15,7,15,8],[6,1,6,8],[1,1,3,4],[21,1,24,1],[17,1,20,1],[9,1,12,1],[8,4,8,6],[9,4,9,6],[10,4,10,6],[12,4,12,6],[9,2,12,2],[13,2,16,2],[17,2,20,2],[21,2,24,2],[13,4,13,6],[14,4,14,6],[18,4,18,6],[17,7,17,8],[14,7,14,8],[16,7,16,8],[19,4,19,6],[19,7,19,8],[17,4,17,6],[18,7,18,8]]}
[null,"UNIDO EIP Management Services Tool (V1)"]
[null,"SUMMARIZE KEY CHALLENGES, OPPORTUNITIES \nAND STRATEGIC ISSUES FACING INDUSTRIAL PARK",null,null,null,"Name industrial park:","Insert name of industrial park"]
[null,null,null,null,null,"Period of assessment:","Insert date"]
[null,null,null,null,null,"Name assessors:","Insert names"]
[]
[]
[null,"Instruction: This step guides park management and tenant companies to summarize the key challenges, opportunities, and strategic issues facing their industrial park. Added-values services provided by park management entities ideally address the underlying common challenges and opportunities facing the industrial park and tenant companies. The challenges and opportunities are reviewed from an economic, environmental and social perspective."]
[]
[null,"Category","Illustrative examples of challenges, opportunities, and strategic issues","Top 3","What are key challenges, opportunities, and strategic issues facing industrial park?",null,null,"Provide additional comments"]
[null,"Economic challenges, opportunities, and strategic issues","• Industrial park is struggling to attract new investors\n\n• Increasing costs of critical raw materials required by tenant companies",1,"Please insert one key challenge, opportunity, strategic issue here"]
{"$rows_left_out":16}
{"sheet":"2.Select service categories","index":2,"n_rows":76,"n_cols":10,"rows_kept":76,"cut":false,"hidden":false,"merged":[[1,1,3,4],[57,2,59,2],[10,1,19,1],[20,1,23,1],[34,1,38,1],[24,1,33,1],[42,1,45,1],[24,2,26,2],[50,1,53,1],[6,1,6,5],[52,3,52,7],[47,3,47,7],[33,3,33,7],[11,3,11,7],[10,2,14,2],[29,3,29,7],[72,1,75,1],[8,3,8,7],[27,3,27,7],[36,2,38,2],[36,3,36,7],[38,3,38,7],[18,3,18,7],[37,3,37,7],[28,3,28,7],[27,2,28,2],[34,3,34,7],[24,3,24,7],[25,3,25,7],[54,1,64,1],[39,1,41,1],[47,1,49,1],[16,2,17,2],[65,1,71,1],[14,3,14,7],[71,3,71,7],[70,3,70,7],[62,3,62,7],[61,3,61,7],[60,3,60,7],[66,3,66,7],[68,3,68,7],[43,2,45,2],[55,2,56,2],[49,3,49,7],[65,3,65,7],[58,3,58,7],[20,2,22,2],[10,3,10,7],[13,3,13,7],[12,3,12,7],[21,3,21,7],[19,3,19,7],[17,3,17,7],[15,3,15,7],[20,3,20,7],[73,3,73,7],[60,2,62,2],[63,2,64,2],[32,3,32,7],[40,3,40,7],[39,2,41,2],[39,3,39,7],[65,2,68,2],[47,2,49,2],[50,2,51,2],[54,3,54,7],[32,2,33,2],[50,3,50,7],[51,3,51,7],[70,2,71,2],[44,3,44,7],[35,3,35,7],[42,3,42,7],[48,3,48,7],[56,3,56,7],[55,3,55,7],[53,3,53,7],[23,3,23,7],[30,3,30,7],[29,2,31,2],[31,3,31,7],[22,3,22,7],[73,9,75,9],[16,3,16,7],[74,3,74,7],[75,3,75,7],[73,2,75,2],[45,3,45,7],[67,3,67,7],[26,3,26,7],[41,3,41,7],[43,3,43,7],[59,3,59,7],[69,3,69,7],[72,3,72,7],[64,3,64,7],[63,3,63,7],[57,3,57,7]]}
[null,"UNIDO EIP Management Services Tool (V1)"]
[null,"SELECT SERVICE CATEGORIES \nTO REVIEW IN DETAIL",null,null,null,"Name industrial park:",{"$f":"'1.Challenges & opportunities'!G2","v":"Insert name of industrial park"}]
[null,null,null,null,null,"Period of assessment:",{"$f":"'1.Challenges & opportunities'!G3","v":"Insert date"}]
[null,null,null,null,null,"Name assessors:",{"$f":"'1.Challenges & opportunities'!G4","v":"Insert names"}]
[]
[]
[null,"Instruction: The purpose of this step is to do a \"quick scan\" of all service categories included in the tool and select categories to review in detail in the next step of the tool. This step will enable an effective use of the tool in the following steps."]
[]
[null,"Main service category","Sub-category","Added value park management services included in each category",null,null,null,null,"Select category and services for review in step 3?","Comments"]
[null,"ADDED VALUE PARK MANAGEMENT SERVICES"]
{"$rows_left_out":67}
{"sheet":"3.Review PM services","index":3,"n_rows":50,"n_cols":16,"rows_kept":50,"cut":false,"hidden":false,"merged":[[9,14,9,15],[1,1,3,3],[6,1,6,12],[9,5,9,6],[9,9,9,12],[9,1,9,4],[9,7,9,8],[1,5,1,7],[2,5,2,7],[3,5,3,7]]}
[null,"UNIDO EIP Management Services Tool (V1)"]
[null,"REVIEW AND PRIORITIZE ADDED-VALUE PARK MANAGEMENT SERVICES",null,null,"Name industrial park:",{"$f":"'1.Challenges & opportunities'!G2","v":"Insert name of industrial park"}]
[null,null,null,null,"Period of assessment:",{"$f":"'1.Challenges & opportunities'!G3","v":"Insert date"}]
[null,null,null,null,"Name assessors:",{"$f":"'1.Challenges & opportunities'!G4","v":"Insert names"}]
[]
[]
[null,"Instruction: This step guides park management and tenant companies to review a long-list of categorized added-value services and define specific services for the industrial park. Added-value services which are most achievable, show highest anticipated benefits and interest from park management / companies are prioritized and recommended for short-term action."]
[]
[]
[null,"ADDED VALUE SERVICES INCLUDED IN THIS TOOL",null,null,null,"REVIEW EXISTING SERVICES",null,"NEW SERVICES",null,"PRIORITIZATION OF DEFINED ADDED-VALUE SERVICES",null,null,null,null,"ACTION"]
{"$rows_left_out":41}
{"sheet":"3.Review I4.0 services (option)","index":4,"n_rows":43,"n_cols":16,"rows_kept":43,"cut":false,"hidden":false,"merged":[[9,14,9,15],[3,6,3,8],[1,1,3,3],[9,5,9,6],[6,1,6,12],[9,9,9,12],[9,1,9,4],[9,7,9,8]]}
[null,"UNIDO EIP Management Services Tool (V1)"]
[null,"OPTIONAL: REVIEW AND PRIORITIZE\nINDUSTRY 4.0 SERVICES",null,null,null,"Name industrial park:",{"$f":"'1.Challenges & opportunities'!G2","v":"Insert name of industrial park"}]
[null,null,null,null,null,"Period of assessment:",{"$f":"'1.Challenges & opportunities'!G3","v":"Insert date"}]
[null,null,null,null,null,"Name assessors:",{"$f":"'1.Challenges & opportunities'!G4","v":"Insert names"}]
[]
[]
[null,"Instruction:  This step guides park management and tenant companies to review a long-list of categorized Industry 4.0 services and define specific services for the industrial park. Industry 4.0 services which are most achievable, show highest anticipated benefits and interest from park management / companies are prioritized and recommended for short-term action."]
[]
[]
[null,"INDUSTRY 4.0 SERVICES INCLUDED IN THIS TOOL",null,null,null,"REVIEW EXISTING SERVICES",null,"NEW SERVICES",null,"PRIORITIZATION OF ADDED-VALUE SERVICES",null,null,null,null,"ACTION"]
{"$rows_left_out":34}
{"sheet":"3.Executive summary","index":5,"n_rows":47,"n_cols":18,"rows_kept":47,"cut":false,"hidden":false,"merged":[[1,1,3,3],[1,6,1,8],[2,6,2,8],[3,6,3,8],[13,12,13,13],[6,5,6,13],[7,3,12,3],[7,4,8,4],[9,4,10,4],[11,4,12,4],[14,5,14,13],[7,1,7,2],[8,1,8,2],[9,1,9,2],[10,1,10,2],[11,1,11,2],[12,1,12,2],[17,10,17,17],[17,1,17,8],[7,8,7,10],[8,8,8,10],[7,5,7,6],[8,5,8,6],[9,5,9,6],[10,5,10,6],[11,5,11,6],[12,5,12,6],[9,8,9,10],[10,8,10,10],[11,8,11,10],[12,8,12,10],[13,5,13,7],[13,8,13,11]]}
[null,"UNIDO EIP Management Services Tool (V1)"]
[null,"EXECUTIVE SUMMARY OF ADDED VALUE SERVICES SELECTED FOR SHORT-TERM ACTION",null,null,null,"Name industrial park:",{"$f":"'1.Challenges & opportunities'!G2","v":"Insert name of industrial park"}]
[null,null,null,null,null,"Period of assessment:",{"$f":"'1.Challenges & opportunities'!G3","v":"Insert date"}]
[null,null,null,null,null,"Name assessors:",{"$f":"'1.Challenges & opportunities'!G4","v":"Insert names"}]
[]
[]
[null,null,null,null,null,"PRIORITIZATION OF NEW PARK MANAGEMENT AND INDUSTRY 4.0 SERVICES FOR SHORT-TERM ACTION"]
[null,"TOTAL PROPOSED NEW SERVICES",null,"ACHIEVABILITY","High","All",null,{"$f":"COUNTIFS('3.Review PM services'!J12:J50,\"High\",'3.Review PM services'!K12:K50,\"Low\",'3.Review PM services'!O12:O50,\"Yes\")+COUNTIFS('3.Review I4.0 services (option)'!J12:J43,\"High\",'3.Review I4.0 services (option)'!K12:K43,\"Low\",'3.Review I4.0 services (option)'!O12:O43,\"Yes\")","v":0},"All",null,null,{"$f":"COUNTIFS('3.Review PM services'!J12:J50,\"High\",'3.Review PM services'!K12:K50,\"Medium\",'3.Review PM services'!O12:O50,\"Yes\")+COUNTIFS('3.Review I4.0 services (option)'!J12:J43,\"High\",'3.Review I4.0 services (option)'!K12:K43,\"Medium\",'3.Review I4.0 services (option)'!O12:O43,\"Yes\")","v":0},"All",{"$f":"COUNTIFS('3.Review PM services'!J12:J50,\"High\",'3.Review PM services'!K12:K50,\"High\",'3.Review PM services'!O12:O50,\"Yes\")+COUNTIFS('3.Review I4.0 services (option)'!J12:J43,\"High\",'3.Review I4.0 services (option)'!K12:K43,\"High\",'3.Review I4.0 services (option)'!O12:O43,\"Yes\")","v":0}]
[null,{"$f":"B11+B13","v":0},null,null,null,"High interest from park \nmanagement & tenants",null,{"$f":"COUNTIFS('3.Review PM services'!J12:J50,\"High\",'3.Review PM services'!K12:K50,\"Low\",'3.Review PM services'!L12:L50,\"High\",'3.Review PM services'!M12:M50,\"High\",'3.Review PM services'!O12:O50,\"Yes\")+COUNTIFS('3.Review I4.0 services (option)'!J12:J43,\"High\",'3.Review I4.0 services (option)'!K12:K43,\"Low\",'3.Review I4.0 services (option)'!L12:L43,\"High\",'3.Review I4.0 services (option)'!M12:M43,\"High\",'3.Review I4.0 services (option)'!O12:O43,\"Yes\")","v":0},"High interest from park \nmanagement & tenants",null,null,{"$f":"COUNTIFS('3.Review PM services'!J12:J50,\"High\",'3.Review PM services'!K12:K50,\"Medium\",'3.Review PM services'!L12:L50,\"High\",'3.Review PM services'!M12:M50,\"High\",'3.Review PM services'!O12:O50,\"Yes\")+COUNTIFS('3.Review I4.0 services (option)'!J12:J43,\"High\",'3.Review I4.0 services (option)'!K12:K43,\"Medium\",'3.Review I4.0 services (option)'!L12:L43,\"High\",'3.Review I4.0 services (option)'!M12:M43,\"High\",'3.Review I4.0 services (option)'!O12:O43,\"Yes\")","v":0},"High interest from park \nmanagement & tenants",{"$f":"COUNTIFS('3.Review PM services'!J12:J50,\"High\",'3.Review PM services'!K12:K50,\"High\",'3.Review PM services'!L12:L50,\"High\",'3.Review PM services'!M12:M50,\"High\",'3.Review PM services'!O12:O50,\"Yes\")+COUNTIFS('3.Review I4.0 services (option)'!J12:J43,\"High\",'3.Review I4.0 services (option)'!K12:K43,\"High\",'3.Review I4.0 services (option)'!L12:L43,\"High\",'3.Review I4.0 services (option)'!M12:M43,\"High\",'3.Review I4.0 services (option)'!O12:O43,\"Yes\")","v":0}]
[null,"Total new park management services for short-term action:",null,null,"Medium","All",null,{"$f":"COUNTIFS('3.Review PM services'!J12:J50,\"Medium\",'3.Review PM services'!K12:K50,\"Low\",'3.Review PM services'!O12:O50,\"Yes\")+COUNTIFS('3.Review I4.0 services (option)'!J12:J43,\"Medium\",'3.Review I4.0 services (option)'!K12:K43,\"Low\",'3.Review I4.0 services (option)'!O12:O43,\"Yes\")","v":0},"All",null,null,{"$f":"COUNTIFS('3.Review PM services'!J12:J50,\"Medium\",'3.Review PM services'!K12:K50,\"Medium\",'3.Review PM services'!O12:O50,\"Yes\")+COUNTIFS('3.Review I4.0 services (option)'!J12:J43,\"Medium\",'3.Review I4.0 services (option)'!K12:K43,\"Medium\",'3.Review I4.0 services (option)'!O12:O43,\"Yes\")","v":0},"All",{"$f":"COUNTIFS('3.Review PM services'!J12:J50,\"Medium\",'3.Review PM services'!K12:K50,\"High\",'3.Review PM services'!O12:O50,\"Yes\")+COUNTIFS('3.Review I4.0 services (option)'!J12:J43,\"Medium\",'3.Review I4.0 services (option)'!K12:K43,\"High\",'3.Review I4.0 services (option)'!O12:O43,\"Yes\")","v":0}]
{"$rows_left_out":38}
{"sheet":"4.Scope services","index":6,"n_rows":10,"n_cols":13,"rows_kept":10,"cut":false,"hidden":false,"merged":[[6,1,6,9],[1,1,3,2],[8,12,9,12],[8,9,8,11],[8,6,8,8],[8,3,8,5]]}
[null,"UNIDO EIP Management Services Tool (V1)"]
[null,"SCOPE PRIORITIZED\nADDED-VALUE SERVICES",null,null,"Name industrial park:",{"$f":"'1.Challenges & opportunities'!G2","v":"Insert name of industrial park"}]
[null,null,null,null,"Period of assessment:",{"$f":"'1.Challenges & opportunities'!G3","v":"Insert date"}]
[null,null,null,null,"Name assessors:",{"$f":"'1.Challenges & opportunities'!G4","v":"Insert names"}]
[]
[]
[null,"Instruction: To assist with their further development, this step assists park management and tenant companies to scope prioritized added-value services including options for cost / revenue sharing and potential implementation of selected services."]
[]
[null,null,null,"SPECIFICATION OF THE ADDED-VALUE SERVICE",null,null,"COST AND REVENUE SHARING",null,null,"IMPLEMENTATION",null,null,"Comments"]
[null,"Topic","Priority added-value park management services selected for short-term action","What are targeted tenant companies for the added-value service?","What is the value proposition?","What are specific focus areas and features to be included in added-value services","Please provide indication of costs and revenue streams","Can services be offered as part of existing park management fees?","What are options for cost recovery and/or benefit sharing?","What could be the modality of delivering the added-value service?\n(e.g. by park management, tenants, specialised company, outsourcing)","What are success factors to develop and implement added-value services?","What are potential challenges and means to address these?"]
{"$rows_left_out":1}
{"sheet":"5.Action planning","index":7,"n_rows":80,"n_cols":10,"rows_kept":80,"cut":false,"hidden":false,"merged":[[67,4,67,5],[68,4,68,5],[69,4,69,5],[57,4,57,5],[46,9,49,9],[51,4,51,5],[52,4,52,5],[53,4,53,5],[54,4,54,5],[66,4,66,5],[41,1,44,1],[61,1,64,1],[61,2,64,2],[61,4,61,5],[62,4,62,5],[63,4,63,5],[64,4,64,5],[51,1,54,1],[58,4,58,5],[59,4,59,5],[56,1,59,1],[56,2,59,2],[56,4,56,5],[46,4,46,5],[41,2,44,2],[11,1,14,1],[11,2,14,2],[11,4,11,5],[12,4,12,5],[41,9,44,9],[22,4,22,5],[23,4,23,5],[24,4,24,5],[26,1,29,1],[26,2,29,2],[26,4,26,5],[27,4,27,5],[28,4,28,5],[29,4,29,5],[31,1,34,1],[31,2,34,2],[8,9,9,9],[9,3,9,5],[8,1,9,1],[8,2,9,2],[8,3,8,8],[1,6,1,7],[2,6,2,7],[3,6,3,7],[1,1,3,4],[42,4,42,5],[13,4,13,5],[14,4,14,5],[41,4,41,5],[31,4,31,5],[32,4,32,5],[33,4,33,5],[34,4,34,5],[6,1,6,9],[21,1,24,1],[21,2,24,2],[21,4,21,5],[46,2,49,2],[43,4,43,5],[47,4,47,5],[48,4,48,5],[49,4,49,5],[44,4,44,5],[36,1,39,1],[36,2,39,2],[36,4,36,5],[37,4,37,5],[38,4,38,5],[39,4,39,5],[46,1,49,1],[66,1,69,1],[76,1,79,1],[76,2,79,2],[76,4,76,5],[77,4,77,5],[78,4,78,5],[79,4,79,5],[71,1,74,1],[71,2,74,2],[71,4,71,5],[72,4,72,5],[73,4,73,5],[74,4,74,5],[51,2,54,2],[66,2,69,2],[16,1,19,1],[16,2,19,2],[16,4,16,5],[17,4,17,5],[18,4,18,5],[19,4,19,5]]}
[null,"UNIDO EIP Management Services Tool (V1)"]
[null,"ACTION PLANNING FOR ADDED-VALUE PARK MANAGEMENT AND INDUSTRY 4.0 SERVICES",null,null,null,"Name industrial park:",{"$f":"'1.Challenges & opportunities'!G2","v":"Insert name of industrial park"}]
[null,null,null,null,null,"Period of assessment:",{"$f":"'1.Challenges & opportunities'!G3","v":"Insert date"}]
[null,null,null,null,null,"Name assessors:",{"$f":"'1.Challenges & opportunities'!G4","v":"Insert names"}]
[]
[]
[null,"Instruction: Following the scoping of the prioritized added-value and industry 4.0 services, this step guides park management and tenant companies to produce a practical plan with short-term actions to develop and implement selected services. Recognizing that park management may already have systems in place to manage its activities, it is envisaged that the action planning of prioritized services is adapted to existing systems."]
[]
[null,"Topic","Services selected for short-term action","ACTIONS",null,null,null,null,null,"Comments and progress \non actions"]
[null,null,null,"Key short-terms actions",null,null,"Lead role","Supporting role","Timeline"]
{"$rows_left_out":70}