{"text_format":"1","workbook":"xlsx","n_sheets":8,"sheets":["Instructions","1.Défis et opportunités","2.Sélectionner les catégories d","3.Examiner les services de gest","3.Révision des services I4.0 (o","3.Résumé","4.Services de portée","5.Plan d’action"],"not_rendered":{"charts":0,"images":14,"macros":1,"external_links":0,"defined_names":21,"comments":0,"pivot_tables":2},"unopened":[],"bounds":{"document_bytes":16777216,"sheet_cells":100000,"rows_first":2000,"rows_last":500,"rows_between":2000,"halvings":0,"cell_chars":16384,"cell_head_chars":4096},"cells_cut":0,"cells_raw":0,"read":"whole","date_system":"1900"}

{"sheet":"Instructions","index":0,"n_rows":154,"n_cols":72,"rows_kept":154,"cut":false,"hidden":false,"merged":[[57,54,58,63],[57,64,58,70],[57,71,58,79],[59,54,60,63],[59,64,60,70],[59,71,60,79],[68,2,68,13],[68,17,80,50],[69,54,70,63],[69,64,70,70],[73,64,74,70],[73,71,74,79],[75,54,76,63],[71,64,72,70],[71,71,72,79],[73,54,74,63],[61,64,62,70],[61,71,62,79],[63,54,64,63],[63,64,64,70],[63,71,64,79],[65,54,66,63],[65,64,66,70],[65,71,66,79],[3,1,3,80],[5,1,5,80],[7,1,7,80],[10,1,10,80],[13,1,13,80],[15,1,16,80],[22,2,22,13],[22,54,22,79],[17,54,17,79],[18,54,20,79],[22,17,22,50],[9,1,9,80],[11,1,11,80],[24,2,24,13],[24,17,33,50],[24,54,25,63],[24,64,25,70],[24,71,25,79],[25,2,33,13],[32,54,33,63],[32,64,33,70],[32,71,33,79],[26,54,27,63],[26,64,27,70],[26,71,27,79],[28,54,29,63],[28,64,29,70],[28,71,29,79],[30,54,31,63],[30,64,31,70],[30,71,31,79],[46,2,46,13],[46,17,55,50],[46,54,47,63],[46,64,47,70],[46,71,47,79],[48,54,49,63],[48,64,49,70],[48,71,49,79],[50,54,51,63],[50,64,51,70],[50,71,51,79],[54,54,55,63],[54,64,55,70],[54,71,55,79],[52,54,53,63],[52,64,53,70],[52,71,53,79],[115,61,115,79],[113,23,113,40],[114,23,114,40],[115,23,115,40],[113,42,113,59],[115,42,115,59],[77,54,78,63],[77,64,78,70],[77,71,78,79],[83,1,83,80],[69,2,80,13],[71,54,72,63],[75,64,76,70],[75,71,76,79],[69,71,70,79],[147,1,149,80],[87,12,95,42],[87,46,95,80],[85,12,85,46],[85,48,85,79],[143,1,143,14],[113,2,113,21],[114,2,114,21],[115,2,115,21],[113,61,113,79],[114,61,114,79],[97,1,97,80],[99,3,99,13],[108,3,108,13],[99,20,99,34],[108,19,108,33],[108,45,108,55],[99,45,100,55],[107,45,107,55],[108,67,108,77],[99,67,100,77],[140,1,140,80],[126,1,126,80],[111,1,111,80],[35,2,35,13],[35,17,44,50],[58,2,66,13],[36,2,44,13],[35,54,36,63],[35,64,36,70],[35,71,36,79],[37,54,38,63],[37,64,38,70],[37,71,38,79],[39,54,40,63],[39,64,40,70],[39,71,40,79],[41,54,42,63],[41,64,42,70],[41,71,42,79],[43,54,44,63],[43,64,44,70],[43,71,44,79],[47,2,51,13],[52,2,55,13],[57,2,57,13],[57,17,66,50],[61,54,62,63]]}
[null,"Outil de services de gestion de PEI de l’ONUDI (V1)"]
[null,"OUTIL DE GESTION de PEI : INSTRUCTIONS"]
[]
[null,"RAISON D’ÊTRE DE L’OUTIL"]
[]
[null,"Dans de nombreux parcs industriels, la direction du parc fournit les services \"traditionnels\" à ses locataires, tels que la location/vente de terrains industriels aux entreprises locataires, la facturation de l’électricité et de l’eau, l’entretien des routes, des clôtures et des immeubles de bureaux à l’intérieur du parc, ainsi que des services de sécurité de base. Cependant, il existe de nombreux services à valeur ajoutée que la gestion des parcs pourrait fournir afin de.. : \n• Aider les entreprises locataires à améliorer leurs performances économiques, environnementales et sociales ;\n• Réduire les risques du parc et des entreprises, en soulignant que les risques environnementaux et sociaux sont des risques commerciaux ;\n• Créer un parc industriel plus efficace en termes de ressources et de coûts, plus compétitif et plus attrayant pour les investisseurs ;\n• Permettre aux entreprises locataires de se concentrer sur leurs activités principales et de réaliser des économies grâce à des synergies de services.\n\nEn outre, l’industrie 4.0 fournit de nouvelles solutions pour la chaîne de valeur de la production grâce au développement des TIC (par exemple, l’internet des objets) et à des solutions d’automatisation intelligentes qui sont applicables à la gestion des parcs industriels et aux entreprises locataires. L’industrie 4.0 aura une influence considérable sur la conception et l’exploitation des processus industriels et des parcs industriels."]
[]
[null,"OBJECTIFS DE L’OUTIL"]
[]
[null,"L’objectif de cet outil est de renforcer et d’améliorer les services fournis par la gestion du parc aux entreprises locataires, et ainsi d’augmenter le « rapport qualité-prix » fourni par la gestion du parc aux entreprises locataires et de sécuriser/accroître les revenus de l’entité de gestion du parc. Cet outil aide les entités de gestion des parcs industriels et les entreprises locataires à examiner, hiérarchiser, délimiter et planifier des services adaptés et à valeur ajoutée pour leur parc et leurs entreprises locataires. "]
{"$rows_left_out":145}
{"sheet":"1.Défis et opportunités","index":1,"n_rows":25,"n_cols":8,"rows_kept":25,"cut":false,"hidden":false,"merged":[[17,7,17,8],[14,7,14,8],[16,7,16,8],[19,4,19,6],[19,7,19,8],[17,4,17,6],[18,7,18,8],[6,1,6,8],[1,1,3,4],[21,1,24,1],[17,1,20,1],[9,1,12,1],[8,4,8,6],[9,4,9,6],[10,4,10,6],[12,4,12,6],[9,2,12,2],[13,2,16,2],[17,2,20,2],[21,2,24,2],[13,4,13,6],[14,4,14,6],[18,4,18,6],[13,1,16,1],[8,7,8,8],[9,7,9,8],[10,7,10,8],[12,7,12,8],[13,7,13,8],[11,4,11,6],[15,4,15,6],[16,4,16,6],[11,7,11,8],[15,7,15,8],[24,7,24,8],[20,4,20,6],[21,4,21,6],[23,4,23,6],[24,4,24,6],[21,7,21,8],[23,7,23,8],[20,7,20,8],[22,4,22,6],[22,7,22,8]]}
[null,"Outil de services de gestion de PEI de l’ONUDI (V1)"]
[null,"RÉSUMER LES PRINCIPAUX DÉFIS ET OPPORTUNITÉS \nET LES QUESTIONS STRATÉGIQUES AUXQUELLES EST CONFRONTÉ LE PARC INDUSTRIEL",null,null,null,"Nom du parc industriel :","Insérer le nom du parc industriel"]
[null,null,null,null,null,"Période d’évaluation :","Insérer la date"]
[null,null,null,null,null,"Nom des assesseurs :","Insérer les noms"]
[]
[]
[null,"Instruction : Cette étape permet à la direction du parc et aux entreprises locataires de résumer les principaux défis, opportunités et questions stratégiques auxquels leur parc industriel est confronté. Les services à valeur ajoutée fournis par les entités de gestion du parc répondent idéalement aux défis et opportunités communs sous-jacents auxquels sont confrontés le parc industriel et les entreprises locataires. Les défis et les opportunités sont examinés d’un point de vue économique, environnemental et social."]
[]
[null,"Catégorie","Exemples de défis, d’opportunités et de questions stratégiques","Top 3","Quels sont les principaux défis, opportunités et enjeux stratégiques auxquels le parc industriel est confronté ?",null,null,"Fournir des commentaires supplémentaires"]
[null,"Défis économiques, opportunités et questions stratégiques","• Le parc industriel peine à attirer de nouveaux investisseurs\n\n• Augmentation du coût des matières premières essentielles dont ont besoin les entreprises locataires",1,"Veuillez insérer ici un défi, une opportunité ou une question stratégique clé"]
{"$rows_left_out":16}
{"sheet":"2.Sélectionner les catégories d","index":2,"n_rows":76,"n_cols":10,"rows_kept":76,"cut":false,"hidden":false,"merged":[[73,9,75,9],[16,3,16,7],[74,3,74,7],[75,3,75,7],[73,2,75,2],[45,3,45,7],[67,3,67,7],[26,3,26,7],[41,3,41,7],[43,3,43,7],[59,3,59,7],[69,3,69,7],[72,3,72,7],[64,3,64,7],[63,3,63,7],[57,3,57,7],[23,3,23,7],[30,3,30,7],[29,2,31,2],[31,3,31,7],[22,3,22,7],[35,3,35,7],[42,3,42,7],[48,3,48,7],[56,3,56,7],[55,3,55,7],[53,3,53,7],[73,3,73,7],[60,2,62,2],[63,2,64,2],[32,3,32,7],[40,3,40,7],[39,2,41,2],[39,3,39,7],[65,2,68,2],[47,2,49,2],[50,2,51,2],[54,3,54,7],[32,2,33,2],[50,3,50,7],[51,3,51,7],[70,2,71,2],[44,3,44,7],[10,3,10,7],[13,3,13,7],[12,3,12,7],[21,3,21,7],[19,3,19,7],[17,3,17,7],[15,3,15,7],[20,3,20,7],[16,2,17,2],[65,1,71,1],[14,3,14,7],[71,3,71,7],[70,3,70,7],[62,3,62,7],[61,3,61,7],[60,3,60,7],[66,3,66,7],[68,3,68,7],[43,2,45,2],[55,2,56,2],[49,3,49,7],[65,3,65,7],[58,3,58,7],[20,2,22,2],[72,1,75,1],[8,3,8,7],[27,3,27,7],[36,2,38,2],[36,3,36,7],[38,3,38,7],[18,3,18,7],[37,3,37,7],[28,3,28,7],[27,2,28,2],[34,3,34,7],[24,3,24,7],[25,3,25,7],[54,1,64,1],[39,1,41,1],[47,1,49,1],[1,1,3,4],[57,2,59,2],[10,1,19,1],[20,1,23,1],[34,1,38,1],[24,1,33,1],[42,1,45,1],[24,2,26,2],[50,1,53,1],[6,1,6,5],[52,3,52,7],[47,3,47,7],[33,3,33,7],[11,3,11,7],[10,2,14,2],[29,3,29,7]]}
[null,"Outil de services de gestion de PEI de l’ONUDI (V1)"]
[null,"SÉLECTIONNER LES CATÉGORIES DE SERVICES \nEXAMINER EN DÉTAIL",null,null,null,"Nom du parc industriel :",{"$f":"'1.Défis et opportunités'!G2","v":"Insérer le nom du parc industriel"}]
[null,null,null,null,null,"Période d’évaluation :",{"$f":"'1.Défis et opportunités'!G3","v":"Insérer la date"}]
[null,null,null,null,null,"Nom des assesseurs :",{"$f":"'1.Défis et opportunités'!G4","v":"Insérer les noms"}]
[]
[]
[null,"Instruction : L’objectif de cette étape est de procéder à un \"examen rapide\" de toutes les catégories de services incluses dans l’outil et de sélectionner les catégories à examiner en détail dans l’étape suivante de l’outil. Cette étape permettra une utilisation efficace de l’outil dans les étapes suivantes."]
[]
[null,"Principale catégorie de services","Sous-catégorie","Valeur ajoutée des services de gestion des parcs inclus dans chaque catégorie",null,null,null,null,"Sélectionner la catégorie et les services à examiner à l’étape 3 ?","Commentaires"]
[null,"SERVICES DE GESTION DES PARCS À VALEUR AJOUTÉE"]
{"$rows_left_out":67}
{"sheet":"3.Examiner les services de gest","index":3,"n_rows":50,"n_cols":16,"rows_kept":50,"cut":false,"hidden":false,"merged":[[9,14,9,15],[1,1,3,3],[6,1,6,12],[9,5,9,6],[9,9,9,12],[9,1,9,4],[9,7,9,8],[1,5,1,7],[2,5,2,7],[3,5,3,7]]}
[null,"Outil de services de gestion de PEI de l’ONUDI (V1)"]
[null,"EXAMINER ET HIÉRARCHISER LES SERVICES DE GESTION DES PARCS À VALEUR AJOUTÉE",null,null,"Nom du parc industriel :",{"$f":"'1.Défis et opportunités'!G2","v":"Insérer le nom du parc industriel"}]
[null,null,null,null,"Période d’évaluation :",{"$f":"'1.Défis et opportunités'!G3","v":"Insérer la date"}]
[null,null,null,null,"Nom des assesseurs :",{"$f":"'1.Défis et opportunités'!G4","v":"Insérer les noms"}]
[]
[]
[null,"Instruction : Cette étape permet à la direction du parc et aux entreprises locataires de passer en revue une longue liste de services à valeur ajoutée catégorisés et de définir des services spécifiques pour le parc industriel. Les services à valeur ajoutée qui sont les plus réalisables, qui présentent les avantages les plus importants et qui suscitent le plus d’intérêt de la part de la direction du parc et des entreprises sont classés par ordre de priorité et font l’objet d’une recommandation d’action à court terme."]
[]
[]
[null,"SERVICES À VALEUR AJOUTÉE INCLUS DANS CET OUTIL",null,null,null,"EXAMINER LES SERVICES EXISTANTS",null,"NOUVEAUX SERVICES",null,"LA HIÉRARCHISATION DES SERVICES À VALEUR AJOUTÉE DÉFINIS",null,null,null,null,"ACTION"]
{"$rows_left_out":41}
{"sheet":"3.Révision des services I4.0 (o","index":4,"n_rows":43,"n_cols":16,"rows_kept":43,"cut":false,"hidden":false,"merged":[[9,14,9,15],[3,6,3,8],[1,1,3,3],[9,5,9,6],[6,1,6,12],[9,9,9,12],[9,1,9,4],[9,7,9,8]]}
[null,"Outil de services de gestion de PEI de l’ONUDI (V1)"]
[null,"FACULTATIF : EXAMINER ET DONNER LA PRIORITÉ AUX\nSERVICES DE L’INDUSTRIE 4.0",null,null,null,"Nom du parc industriel :",{"$f":"'1.Défis et opportunités'!G2","v":"Insérer le nom du parc industriel"}]
[null,null,null,null,null,"Période d’évaluation :",{"$f":"'1.Défis et opportunités'!G3","v":"Insérer la date"}]
[null,null,null,null,null,"Nom des assesseurs :",{"$f":"'1.Défis et opportunités'!G4","v":"Insérer les noms"}]
[]
[]
[null,"Instruction :  Cette étape guide la direction du parc et les entreprises locataires dans l’examen d’une longue liste de services Industrie 4.0 catégorisés et dans la définition de services spécifiques pour le parc industriel. Les services de l’industrie 4.0 qui sont les plus réalisables, qui présentent les avantages les plus importants et qui suscitent le plus d’intérêt de la part de la direction du parc et des entreprises sont classés par ordre de priorité et font l’objet d’une recommandation pour une action à court terme."]
[]
[]
[null,"SERVICES DE L’INDUSTRIE 4.0 INCLUS DANS CET OUTIL",null,null,null,"EXAMINER LES SERVICES EXISTANTS",null,"NOUVEAUX SERVICES",null,"PRIORITÉ AUX SERVICES À VALEUR AJOUTÉE",null,null,null,null,"ACTION"]
{"$rows_left_out":34}
{"sheet":"3.Résumé","index":5,"n_rows":47,"n_cols":18,"rows_kept":47,"cut":false,"hidden":false,"merged":[[17,10,17,17],[17,1,17,8],[7,8,7,10],[8,8,8,10],[7,5,7,6],[8,5,8,6],[9,5,9,6],[10,5,10,6],[11,5,11,6],[12,5,12,6],[9,8,9,10],[10,8,10,10],[11,8,11,10],[12,8,12,10],[13,5,13,7],[13,8,13,11],[14,5,14,13],[7,1,7,2],[8,1,8,2],[9,1,9,2],[10,1,10,2],[11,1,11,2],[12,1,12,2],[1,1,3,3],[1,6,1,8],[2,6,2,8],[3,6,3,8],[13,12,13,13],[6,5,6,13],[7,3,12,3],[7,4,8,4],[9,4,10,4],[11,4,12,4]]}
[null,"Outil de services de gestion de PEI de l’ONUDI (V1)"]
[null,"RÉSUMÉ DES SERVICES À VALEUR AJOUTÉE SÉLECTIONNÉS POUR UNE ACTION À COURT TERME",null,null,null,"Nom du parc industriel :",{"$f":"'1.Défis et opportunités'!G2","v":"Insérer le nom du parc industriel"}]
[null,null,null,null,null,"Période d’évaluation :",{"$f":"'1.Défis et opportunités'!G3","v":"Insérer la date"}]
[null,null,null,null,null,"Nom des assesseurs :",{"$f":"'1.Défis et opportunités'!G4","v":"Insérer les noms"}]
[]
[]
[null,null,null,null,null,"PRIORISATION DES NOUVEAUX SERVICES DE GESTION DES PARCS ET DE L’INDUSTRIE 4.0 POUR UNE ACTION À COURT TERME"]
[null,"TOTAL DES NOUVEAUX SERVICES PROPOSÉS",null,"RÉALISABILITÉ","Élevée","Tout",null,{"$f":"COUNTIFS('3.Examiner les services de gest'!J12:J50,\"High\",'3.Examiner les services de gest'!K12:K50,\"Low\",'3.Examiner les services de gest'!O12:O50,\"Yes\")+COUNTIFS('3.Révision des services I4.0 (o'!J12:J43,\"High\",'3.Révision des services I4.0 (o'!K12:K43,\"Low\",'3.Révision des services I4.0 (o'!O12:O43,\"Yes\")","v":0},"Tout",null,null,{"$f":"COUNTIFS('3.Examiner les services de gest'!J12:J50,\"High\",'3.Examiner les services de gest'!K12:K50,\"Medium\",'3.Examiner les services de gest'!O12:O50,\"Yes\")+COUNTIFS('3.Révision des services I4.0 (o'!J12:J43,\"High\",'3.Révision des services I4.0 (o'!K12:K43,\"Medium\",'3.Révision des services I4.0 (o'!O12:O43,\"Yes\")","v":0},"Tout",{"$f":"COUNTIFS('3.Examiner les services de gest'!J12:J50,\"High\",'3.Examiner les services de gest'!K12:K50,\"High\",'3.Examiner les services de gest'!O12:O50,\"Yes\")+COUNTIFS('3.Révision des services I4.0 (o'!J12:J43,\"High\",'3.Révision des services I4.0 (o'!K12:K43,\"High\",'3.Révision des services I4.0 (o'!O12:O43,\"Yes\")","v":0}]
[null,{"$f":"B11+B13","v":0},null,null,null,"Intérêt élevé du parc \ngestion et locataires",null,{"$f":"COUNTIFS('3.Examiner les services de gest'!J12:J50,\"High\",'3.Examiner les services de gest'!K12:K50,\"Low\",'3.Examiner les services de gest'!L12:L50,\"High\",'3.Examiner les services de gest'!M12:M50,\"High\",'3.Examiner les services de gest'!O12:O50,\"Yes\")+COUNTIFS('3.Révision des services I4.0 (o'!J12:J43,\"High\",'3.Révision des services I4.0 (o'!K12:K43,\"Low\",'3.Révision des services I4.0 (o'!L12:L43,\"High\",'3.Révision des services I4.0 (o'!M12:M43,\"High\",'3.Révision des services I4.0 (o'!O12:O43,\"Yes\")","v":0},"Intérêt élevé du parc \ngestion et locataires",null,null,{"$f":"COUNTIFS('3.Examiner les services de gest'!J12:J50,\"High\",'3.Examiner les services de gest'!K12:K50,\"Medium\",'3.Examiner les services de gest'!L12:L50,\"High\",'3.Examiner les services de gest'!M12:M50,\"High\",'3.Examiner les services de gest'!O12:O50,\"Yes\")+COUNTIFS('3.Révision des services I4.0 (o'!J12:J43,\"High\",'3.Révision des services I4.0 (o'!K12:K43,\"Medium\",'3.Révision des services I4.0 (o'!L12:L43,\"High\",'3.Révision des services I4.0 (o'!M12:M43,\"High\",'3.Révision des services I4.0 (o'!O12:O43,\"Yes\")","v":0},"Intérêt élevé du parc \ngestion et locataires",{"$f":"COUNTIFS('3.Examiner les services de gest'!J12:J50,\"High\",'3.Examiner les services de gest'!K12:K50,\"High\",'3.Examiner les services de gest'!L12:L50,\"High\",'3.Examiner les services de gest'!M12:M50,\"High\",'3.Examiner les services de gest'!O12:O50,\"Yes\")+COUNTIFS('3.Révision des services I4.0 (o'!J12:J43,\"High\",'3.Révision des services I4.0 (o'!K12:K43,\"High\",'3.Révision des services I4.0 (o'!L12:L43,\"High\",'3.Révision des services I4.0 (o'!M12:M43,\"High\",'3.Révision des services I4.0 (o'!O12:O43,\"Yes\")","v":0}]
[null,"Total des nouveaux services de gestion des parcs pour une action à court terme :",null,null,"Moyenne","Tout",null,{"$f":"COUNTIFS('3.Examiner les services de gest'!J12:J50,\"Medium\",'3.Examiner les services de gest'!K12:K50,\"Low\",'3.Examiner les services de gest'!O12:O50,\"Yes\")+COUNTIFS('3.Révision des services I4.0 (o'!J12:J43,\"Medium\",'3.Révision des services I4.0 (o'!K12:K43,\"Low\",'3.Révision des services I4.0 (o'!O12:O43,\"Yes\")","v":0},"Tout",null,null,{"$f":"COUNTIFS('3.Examiner les services de gest'!J12:J50,\"Medium\",'3.Examiner les services de gest'!K12:K50,\"Medium\",'3.Examiner les services de gest'!O12:O50,\"Yes\")+COUNTIFS('3.Révision des services I4.0 (o'!J12:J43,\"Medium\",'3.Révision des services I4.0 (o'!K12:K43,\"Medium\",'3.Révision des services I4.0 (o'!O12:O43,\"Yes\")","v":0},"Tout",{"$f":"COUNTIFS('3.Examiner les services de gest'!J12:J50,\"Medium\",'3.Examiner les services de gest'!K12:K50,\"High\",'3.Examiner les services de gest'!O12:O50,\"Yes\")+COUNTIFS('3.Révision des services I4.0 (o'!J12:J43,\"Medium\",'3.Révision des services I4.0 (o'!K12:K43,\"High\",'3.Révision des services I4.0 (o'!O12:O43,\"Yes\")","v":0}]
{"$rows_left_out":38}
{"sheet":"4.Services de portée","index":6,"n_rows":10,"n_cols":13,"rows_kept":10,"cut":false,"hidden":false,"merged":[[6,1,6,9],[1,1,3,2],[8,12,9,12],[8,9,8,11],[8,6,8,8],[8,3,8,5]]}
[null,"Outil de services de gestion de PEI de l’ONUDI (V1)"]
[null,"CLASSEMENTPAR ORDRE DE PRIORITÉ DES CHAMPS D’APPLICATION\nSERVICES À VALEUR AJOUTÉE",null,null,"Nom du parc industriel :",{"$f":"'1.Défis et opportunités'!G2","v":"Insérer le nom du parc industriel"}]
[null,null,null,null,"Période d’évaluation :",{"$f":"'1.Défis et opportunités'!G3","v":"Insérer la date"}]
[null,null,null,null,"Nom des assesseurs :",{"$f":"'1.Défis et opportunités'!G4","v":"Insérer les noms"}]
[]
[]
[null,"Instruction : Pour faciliter leur développement, cette étape aide la direction du parc et les entreprises locataires à définir les services à valeur ajoutée prioritaires, y compris les options de partage des coûts/recettes et la mise en œuvre potentielle des services sélectionnés."]
[]
[null,null,null,"SPÉCIFICATION DU SERVICE À VALEUR AJOUTÉE",null,null,"PARTAGE DES COÛTS ET DES RECETTES",null,null,"MISE EN ŒUVRE",null,null,"Commentaires"]
[null,"Sujet","Services prioritaires de gestion des parcs à valeur ajoutée sélectionnés pour une action à court terme","Quelles sont les entreprises locataires ciblées pour le service à valeur ajoutée ?","Quelle est la proposition de valeur ?","Quels sont les domaines et les caractéristiques spécifiques à inclure dans les services à valeur ajoutée ?","Veuillez indiquer les coûts et les sources de revenus","Les services peuvent-ils être proposés dans le cadre des frais de gestion des parcs existants ?","Quelles sont les possibilités de recouvrement des coûts et/ou de partage des bénéfices ?","Quelles pourraient être les modalités de fourniture du service à valeur ajoutée ?\n(par exemple, par la gestion du parc, les locataires, une société spécialisée, l’externalisation)","Quels sont les facteurs de réussite pour développer et mettre en œuvre des services à valeur ajoutée ?","Quels sont les défis potentiels et les moyens de les relever ?"]
{"$rows_left_out":1}
{"sheet":"5.Plan d’action","index":7,"n_rows":80,"n_cols":10,"rows_kept":80,"cut":false,"hidden":false,"merged":[[16,1,19,1],[16,2,19,2],[16,4,16,5],[17,4,17,5],[18,4,18,5],[19,4,19,5],[46,1,49,1],[66,1,69,1],[76,1,79,1],[76,2,79,2],[76,4,76,5],[77,4,77,5],[78,4,78,5],[79,4,79,5],[71,1,74,1],[71,2,74,2],[71,4,71,5],[72,4,72,5],[73,4,73,5],[74,4,74,5],[51,2,54,2],[66,2,69,2],[36,1,39,1],[36,2,39,2],[36,4,36,5],[37,4,37,5],[38,4,38,5],[39,4,39,5],[43,4,43,5],[47,4,47,5],[48,4,48,5],[49,4,49,5],[44,4,44,5],[1,6,1,7],[2,6,2,7],[3,6,3,7],[1,1,3,4],[42,4,42,5],[13,4,13,5],[14,4,14,5],[41,4,41,5],[31,4,31,5],[32,4,32,5],[33,4,33,5],[34,4,34,5],[6,1,6,9],[21,1,24,1],[21,2,24,2],[21,4,21,5],[8,9,9,9],[9,3,9,5],[8,1,9,1],[8,2,9,2],[8,3,8,8],[11,1,14,1],[11,2,14,2],[11,4,11,5],[12,4,12,5],[41,9,44,9],[22,4,22,5],[23,4,23,5],[24,4,24,5],[26,1,29,1],[26,2,29,2],[26,4,26,5],[27,4,27,5],[28,4,28,5],[29,4,29,5],[31,1,34,1],[31,2,34,2],[41,1,44,1],[61,1,64,1],[61,2,64,2],[61,4,61,5],[62,4,62,5],[63,4,63,5],[64,4,64,5],[51,1,54,1],[58,4,58,5],[59,4,59,5],[56,1,59,1],[56,2,59,2],[56,4,56,5],[46,4,46,5],[41,2,44,2],[46,2,49,2],[67,4,67,5],[68,4,68,5],[69,4,69,5],[57,4,57,5],[46,9,49,9],[51,4,51,5],[52,4,52,5],[53,4,53,5],[54,4,54,5],[66,4,66,5]]}
[null,"Outil de services de gestion de PEI de l’ONUDI (V1)"]
[null,"PLAN D’ACTION POUR LA GESTION DES PARCS À VALEUR AJOUTÉE ET LES SERVICES DE L’INDUSTRIE 4.0",null,null,null,"Nom du parc industriel :",{"$f":"'1.Défis et opportunités'!G2","v":"Insérer le nom du parc industriel"}]
[null,null,null,null,null,"Période d’évaluation :",{"$f":"'1.Défis et opportunités'!G3","v":"Insérer la date"}]
[null,null,null,null,null,"Nom des assesseurs :",{"$f":"'1.Défis et opportunités'!G4","v":"Insérer les noms"}]
[]
[]
[null,"Instruction : Après le cadrage des services à valeur ajoutée et de l’industrie 4.0 priorisés, cette étape guide la direction du parc et les entreprises locataires pour produire un plan pratique avec des actions à court terme pour développer et mettre en œuvre les services sélectionnés. Sachant que la direction du parc peut déjà avoir mis en place des systèmes pour gérer ses activités, il est envisagé d’adapter le plan d’action des services prioritaires aux systèmes existants."]
[]
[null,"Sujet","Services sélectionnés pour une action à court terme","ACTIONS",null,null,null,null,null,"Commentaires et progrès \nsur les actions"]
[null,null,null,"Actions clés à court terme",null,null,"Rôle principal","Rôle de soutien","Calendrier"]
{"$rows_left_out":70}